BDBM446116 (3aR,8aS)-3,5-dichlorobenzyl 2-(1H-benzo[d][1,2,3]triazole-5-carbonyl)octahydropyrrolo[3,4-d]azepine-6(7H)-carboxylate::US10669268, Example 1.11
SMILES Clc1cc(Cl)cc(COC(=O)N2CC[C@@H]3CN(C[C@@H]3CC2)C(=O)c2ccc3[nH]nnc3c2)c1
InChI Key
Data  1 IC50
PDB links: 1 PDB ID matches this monomer.
  Tab Delimited (TSV)   2D SDfile   Computed 3D by Vconf -m prep SDfile
Find this compound or compounds like it in BindingDB:
Activity Spreadsheet -- Enzyme Inhibition Constant Data from BindingDB
Found 1 hit for monomerid = 446116
TargetAtaxin-1(Homo sapiens (Human))
Hoffmann-La Roche
US Patent
LigandPNGBDBM446116((3aR,8aS)-3,5-dichlorobenzyl 2-(1H-benzo[d][1,2,3]...)
Affinity DataIC50:  4nM. Assay description: ATX inhibition was measured by a fluorescence quenching assay using a specifically labeled substrate analogue (MR121 substrate). To obtain this MR121...
Ligand InfoPC cidPC sidPDB
In DepthDetails US Patent