BDBM454162 BDBM50246174::US10716791, Code KP-286
SMILES CC(C)NC(=O)[C@H](CCn1ccnc1)NC(=O)c1ccco1
InChI Key InChIKey=XNRIHZORQGDNDS-LBPRGKRZSA-N
Data  6 KI
  Tab Delimited (TSV)   2D SDfile   Computed 3D by Vconf -m prep SDfile
Find this compound or compounds like it in BindingDB:
Activity Spreadsheet -- Enzyme Inhibition Constant Data from BindingDB
Found 6 hits for monomerid = 454162
TargetProtein-arginine deiminase type-4(Homo sapiens (Human))
University of Toronto
Curated by ChEMBL
LigandPNGBDBM454162(BDBM50246174 | US10716791, Code KP-286)
Affinity DataKi:  8.80E+4nM. Assay description: Inhibition of full length human GST-tagged PAD4 expressed in baculovirus infected Sf9 insect cells preincubated for 30 mins followed by substrate add...
Ligand InfoPC cidPC sid
In DepthDetails ArticlePubMed
TargetProtein-arginine deiminase type-2(Mus musculus)
University of Toronto
Curated by ChEMBL
LigandPNGBDBM454162(BDBM50246174 | US10716791, Code KP-286)
Affinity DataKi:  5.54E+5nM. Assay description: Inhibition of full length mouse GST-tagged PAD2 expressed in baculovirus infected Sf9 insect cells preincubated for 30 mins followed by substrate add...
Ligand InfoPC cidPC sid
In DepthDetails ArticlePubMed
TargetProtein-arginine deiminase type-2(Mus musculus)
University of Toronto
Curated by ChEMBL
LigandPNGBDBM454162(BDBM50246174 | US10716791, Code KP-286)
Affinity DataKi:  5.54E+5nM. Assay description: Materials: PAD1, PAD2, PAD3 and PAD4 were purchased from commercial sources. Assay buffer: 50 mM Tris pH 7.5, 100 mM NaCl, 10 mM CaCl2, 5 mM DTT. Col...
Ligand InfoPC cidPC sid
In DepthDetails US Patent
TargetProtein-arginine deiminase type-4(Homo sapiens (Human))
University of Toronto
Curated by ChEMBL
LigandPNGBDBM454162(BDBM50246174 | US10716791, Code KP-286)
Affinity DataKi:  7.14E+5nM. Assay description: Materials: PAD1, PAD2, PAD3 and PAD4 were purchased from commercial sources. Assay buffer: 50 mM Tris pH 7.5, 100 mM NaCl, 10 mM CaCl2, 5 mM DTT. Col...
Ligand InfoPC cidPC sid
In DepthDetails US Patent
TargetProtein-arginine deiminase type-1(Homo sapiens (Human))
University of Toronto
Curated by ChEMBL
LigandPNGBDBM454162(BDBM50246174 | US10716791, Code KP-286)
Affinity DataKi:  9.64E+5nM. Assay description: Inhibition of full length human GST-tagged PAD1 expressed in baculovirus infected Sf9 insect cells preincubated for 30 mins followed by substrate add...
Ligand InfoPC cidPC sid
In DepthDetails ArticlePubMed
TargetProtein-arginine deiminase type-1(Homo sapiens (Human))
University of Toronto
Curated by ChEMBL
LigandPNGBDBM454162(BDBM50246174 | US10716791, Code KP-286)
Affinity DataKi:  2.50E+6nM. Assay description: Materials: PAD1, PAD2, PAD3 and PAD4 were purchased from commercial sources. Assay buffer: 50 mM Tris pH 7.5, 100 mM NaCl, 10 mM CaCl2, 5 mM DTT. Col...
Ligand InfoPC cidPC sid
In DepthDetails US Patent