BDBM461121 US10774053, Compound 341::US11352329, COMPD # 341
SMILES CC(C)(C)C[C@@]1(NC(=N)N([C@H](COC(=O)N[C@@H]2CC22CC2)c2ccc(Cl)c(c2)-n2ncnc2C(F)F)C1=O)c1ccc(cc1)-c1cnn(c1)C(F)F
InChI Key InChIKey=QNKGCZRNGSRJSA-AZAGJHQNSA-N
Data  2 IC50  1 EC50
  Tab Delimited (TSV)   2D SDfile   Computed 3D by Vconf -m prep SDfile
Find this compound or compounds like it in BindingDB:
Activity Spreadsheet -- Enzyme Inhibition Constant Data from BindingDB
Found 2 hits for monomerid = 461121
TargetEnvelope glycoprotein gp160(Human immunodeficiency virus type 1 group M subtyp...)
Gilead Sciences
US Patent
LigandPNGBDBM461121(US10774053, Compound 341 | US11352329, COMPD # 341)
Affinity DataIC50:  3.20nM. Assay description: Compounds were tested in a high-throughput 384-well assay format for their ability to inhibit the replication of HIV-1 (IIIB) in MT-4 cells. Compound...
Ligand InfoPC cidPC sid
In DepthDetails US Patent
TargetGag-Pol polyprotein(HIV-1)
Gilead Sciences
US Patent
LigandPNGBDBM461121(US10774053, Compound 341 | US11352329, COMPD # 341)
Affinity DataIC50:  3.20nM. Assay description: Inhibitor potency against HIV protease was measured using an enzymatic assay with a fluorogenic readout. To a reaction buffer containing 100 mM ammon...
Ligand InfoPC cidPC sid
In DepthDetails US Patent