BDBM461421 US10774069, Compound 1::US11072585, Example 120::US11459309, Compound 2::US11793797, Compound 1
SMILES NCc1cc(Oc2cccc(c2)C(=O)N2C[C@@H](O)[C@H](F)C2)nc(c1)C(F)(F)F
InChI Key InChIKey=ODGXXYXJORZPHE-ZIAGYGMSSA-N
Data  11 IC50
  Tab Delimited (TSV)   2D SDfile   Computed 3D by Vconf -m prep SDfile
Find this compound or compounds like it in BindingDB:
Activity Spreadsheet -- Enzyme Inhibition Constant Data from BindingDB
Found 11 hits for monomerid = 461421
TargetLysyl oxidase homolog 2(Homo sapiens (Human))
Pharmakea
US Patent
LigandPNGBDBM461421(US10774069, Compound 1 | US11072585, Example 120 |...)
Affinity DataIC50: <300nM. Assay description: LOXL2 amine oxidase activity was evaluated by measuring Amplex Red fluorescence using 10-20× concentrated conditioned media (non BSA-containing) from...
In DepthDetails US Patent
TargetLysyl oxidase homolog 2(Homo sapiens (Human))
Pharmakea
US Patent
LigandPNGBDBM461421(US10774069, Compound 1 | US11072585, Example 120 |...)
Affinity DataIC50: <300nM. Assay description: LOXL2 amine oxidase activity is evaluated by measuring Amplex Red fluorescence using 10-20× concentrated conditioned media from CHO cells stably expr...
In DepthDetails US Patent
TargetLysyl oxidase homolog 2(Homo sapiens (Human))
Pharmakea
US Patent
LigandPNGBDBM461421(US10774069, Compound 1 | US11072585, Example 120 |...)
Affinity DataIC50: <300nM. Assay description: LOXL2 amine oxidase activity is evaluated by measuring Amplex Red fluorescence using 10-20× concentrated conditioned media from CHO cells stably expr...
In DepthDetails US Patent
TargetLysyl oxidase homolog 2(Homo sapiens (Human))
Pharmakea
US Patent
LigandPNGBDBM461421(US10774069, Compound 1 | US11072585, Example 120 |...)
Affinity DataIC50: <300nM. Assay description: LOXL2 amine oxidase activity was evaluated by measuring Amplex Red fluorescence using 10-20× concentrated conditioned media (non BSA-containing) from...
In DepthDetails US Patent
TargetLysyl oxidase homolog 2(Homo sapiens (Human))
Pharmakea
US Patent
LigandPNGBDBM461421(US10774069, Compound 1 | US11072585, Example 120 |...)
Affinity DataIC50: <300nM. Assay description: LOXL2 amine oxidase activity was evaluated by measuring Amplex Red fluorescence using 10-20× concentrated conditioned media (non BSA-containing) from...
In DepthDetails US Patent
TargetProtein-lysine 6-oxidase (LOX)(Homo sapiens (Human))
Pharmakea
US Patent
LigandPNGBDBM461421(US10774069, Compound 1 | US11072585, Example 120 |...)
Affinity DataIC50:  4.70E+4nM. Assay description: Table 9: Human LOX amine oxidase activity was evaluated by measuring Amplex Red fluorescence using 10-20× concentrated conditioned media (BSA-contain...
In DepthDetails US Patent
TargetLysyl oxidase homolog 2(Homo sapiens (Human))
Pharmakea
US Patent
LigandPNGBDBM461421(US10774069, Compound 1 | US11072585, Example 120 |...)
Affinity DataIC50: <300nM. Assay description: Table 8: LOXL2 amine oxidase activity was evaluated by measuring Amplex Red fluorescence using 10-20× concentrated conditioned media (non BSA-contain...
In DepthDetails US Patent
TargetLysyl oxidase homolog 2(Homo sapiens (Human))
Pharmakea
US Patent
LigandPNGBDBM461421(US10774069, Compound 1 | US11072585, Example 120 |...)
Affinity DataIC50:  75.1nM. Assay description: Table 9: Human LOX amine oxidase activity was evaluated by measuring Amplex Red fluorescence using 10-20× concentrated conditioned media (BSA-contain...
In DepthDetails US Patent
TargetLysyl oxidase homolog 2(Homo sapiens (Human))
Pharmakea
US Patent
LigandPNGBDBM461421(US10774069, Compound 1 | US11072585, Example 120 |...)
Affinity DataIC50:  209nM. Assay description: Table 9: The amine oxidase activity was evaluated by measuring Amplex Red fluorescence using commercially available purified, recombinant human LOXL2...
In DepthDetails US Patent
TargetLysyl oxidase homolog 3(Homo sapiens (Human))
Pharmakea
US Patent
LigandPNGBDBM461421(US10774069, Compound 1 | US11072585, Example 120 |...)
Affinity DataIC50:  1.21E+3nM. Assay description: Table 9: The amine oxidase activity was evaluated by measuring Amplex Red fluorescence using commercially available purified, recombinant human LOXL3...
In DepthDetails US Patent
TargetLysyl oxidase homolog 2(Homo sapiens (Human))
Pharmakea
US Patent
LigandPNGBDBM461421(US10774069, Compound 1 | US11072585, Example 120 |...)
Affinity DataIC50: <300nM. Assay description: Table 8: LOXL2 amine oxidase activity was evaluated by measuring Amplex Red fluorescence using 10-20× concentrated conditioned media (non BSA-contain...
In DepthDetails US Patent