BDBM481591 US10913710, Compound 7
SMILES CNC(=S)NCCCOCCCNC(=O)c1ccc(CN(CC2CCNCC2)S(=O)(=O)c2ccc(cc2)S(=O)(=O)N(Cc2ccc(Cl)cc2)C2CCCC2)cc1N
InChI Key InChIKey=JXERPNQCYVPHSU-UHFFFAOYSA-N
Data  1 Kd
  Tab Delimited (TSV)   2D SDfile   Computed 3D by Vconf -m prep SDfile
Find this compound or compounds like it in BindingDB:
Activity Spreadsheet -- Enzyme Inhibition Constant Data from BindingDB
Found 1 hit for monomerid = 481591
TargetRetinal rod rhodopsin-sensitive cGMP 3',5'-cyclic phosphodiesterase subunit delta(Homo sapiens (Human))
Max-Planck-Gesellschaft Zur Forderung Der Wissenschaften
US Patent
LigandPNGBDBM481591(US10913710, Compound 7)
Affinity DataKd:  16nM. Assay description: Binding to PDEδ was validated and quantified by means of a displacement assay employing a fluorescent-tagged analog of the HMG-CoA reductase inh...
Ligand InfoPC cidPC sid
In DepthDetails US Patent