BDBM50270038 CHEMBL4062223
SMILES FC1(F)CCC(CC1)NCCCCN(C[C@H]1Cc2ccccc2CN1)[C@H]1CCCc2cccnc12
InChI Key InChIKey=KVZDMWMWTDNKDM-SXOMAYOGSA-N
Data  3 IC50  1 EC50
  Tab Delimited (TSV)   2D SDfile   Computed 3D by Vconf -m prep SDfile
Find this compound or compounds like it in BindingDB:
Activity Spreadsheet -- Enzyme Inhibition Constant Data from BindingDB
Found 4 hits for monomerid = 50270038
TargetC-X-C chemokine receptor type 4(Homo sapiens (Human))
Emory University
Curated by ChEMBL
LigandPNGBDBM50270038(CHEMBL4062223)
Affinity DataIC50:  3.70nM. Assay description: Antagonist activity at human CXCR4 in CCRF-CEM cells assessed as decrease in SDF-1alpha stimulated Ca2+ flux preincubated for 25 mins followed by SDF...
Ligand InfoPC cidPC sid
In DepthDetails ArticlePubMed
TargetCytochrome P450 2D6(Homo sapiens (Human))
Emory University
Curated by ChEMBL
LigandPNGBDBM50270038(CHEMBL4062223)
Affinity DataIC50:  189nM. Assay description: Inhibition of recombinant human CYP2D6 expressed in microsomes of insect cells using AMMC as substrate preincubated for 30 mins followed by NADP addi...
Ligand InfoPC cidPC sid
In DepthDetails ArticlePubMed
TargetCytochrome P450 3A4(Homo sapiens (Human))
Emory University
Curated by ChEMBL
LigandPNGBDBM50270038(CHEMBL4062223)
Affinity DataIC50:  1.13E+4nM. Assay description: Inhibition of CYP3A4 (unknown origin)
Ligand InfoPC cidPC sid
In DepthDetails ArticlePubMed
TargetC-X-C chemokine receptor type 4(Homo sapiens (Human))
Emory University
Curated by ChEMBL
LigandPNGBDBM50270038(CHEMBL4062223)
Affinity DataEC50: >3.00E+4nM. Assay description: Agonist activity at CXCR4 in human CCRF-CEM cells assessed as induction of Ca2+ flux measured for 90 secs by calcium dye-based fluorescence assay
Ligand InfoPC cidPC sid
In DepthDetails ArticlePubMed