BDBM50313264 CHEMBL1087773::N-(3-(4-(2,3-dimethylphenyl)piperazin-1-yl)propyl)-1-(4-fluorophenyl)-2-methyl-5-phenyl-1H-pyrrole-3-carboxamide
SMILES Cc1c(cc(-c2ccccc2)n1-c1ccc(F)cc1)C(=O)NCCCN1CCN(CC1)c1cccc(C)c1C
InChI Key InChIKey=XXLRZXFIYXHDKX-UHFFFAOYSA-N
Data  3 IC50
  Tab Delimited (TSV)   2D SDfile   Computed 3D by Vconf -m prep SDfile
Find this compound or compounds like it in BindingDB:
Activity Spreadsheet -- Enzyme Inhibition Constant Data from BindingDB
Found 3 hits for monomerid = 50313264
Target5-hydroxytryptamine receptor 2A(Homo sapiens (Human))
Green Cross
Curated by ChEMBL
LigandPNGBDBM50313264(CHEMBL1087773 | N-(3-(4-(2,3-dimethylphenyl)pipera...)
Affinity DataIC50:  6.90nM. Assay description: Displacement of [3H]ketanserin from human recombinant 5-HT2A receptor expressed in CHO-K1 cells after 60 mins
In DepthDetails ArticlePubMed
TargetSodium-dependent serotonin transporter(Homo sapiens (Human))
Green Cross
Curated by ChEMBL
LigandPNGBDBM50313264(CHEMBL1087773 | N-(3-(4-(2,3-dimethylphenyl)pipera...)
Affinity DataIC50:  53.6nM. Assay description: Displacement of [3H]imipramine from human SERT expressed in HEK293 cells after 30 mins by rapid filtration assay
In DepthDetails ArticlePubMed
Target5-hydroxytryptamine receptor 2C(Homo sapiens (Human))
Green Cross
Curated by ChEMBL
LigandPNGBDBM50313264(CHEMBL1087773 | N-(3-(4-(2,3-dimethylphenyl)pipera...)
Affinity DataIC50:  162nM. Assay description: Displacement of [3H]mesulergine from human recombinant 5-HT2C receptor expressed in CHO-K1 cells after 60 mins by rapid filtration assay
In DepthDetails ArticlePubMed