BDBM70604 2-(4-ethylphenoxy)-N-[(3-ketoindan-1-ylidene)amino]acetamide::2-(4-ethylphenoxy)-N-[(3-oxidanylideneinden-1-ylidene)amino]ethanamide::2-(4-ethylphenoxy)-N-[(3-oxo-1-indenylidene)amino]acetamide::2-(4-ethylphenoxy)-N-[(3-oxoinden-1-ylidene)amino]acetamide::MLS000535919::SMR000151307::cid_3641809
SMILES CCc1ccc(OCC(=O)NN=C2CC(=O)c3ccccc23)cc1
InChI Key InChIKey=NTCDOWNXPSCQRK-UHFFFAOYSA-N
Data  6 IC50
  Tab Delimited (TSV)   2D SDfile   Computed 3D by Vconf -m prep SDfile
Find this compound or compounds like it in BindingDB:
Activity Spreadsheet -- Enzyme Inhibition Constant Data from BindingDB
Found 6 hits for monomerid = 70604
TargetSentrin-specific protease 8(Homo sapiens (Human))
Burnham Center For Chemical Genomics
Curated by PubChem BioAssay
LigandPNGBDBM70604(2-(4-ethylphenoxy)-N-[(3-ketoindan-1-ylidene)amino...)
Affinity DataIC50:  8.49E+3nM. Assay description: Data Source: Sanford-Burnham Center for Chemical Genomics (SBCCG) Source Affiliation: Sanford-Burnham Medical Research Institute (SBMRI, San Diego, C...
Ligand InfoPC cidPC sid
In DepthDetails PCBioAssay
TargetSentrin-specific protease 6(Homo sapiens (Human))
Burnham Center For Chemical Genomics
Curated by PubChem BioAssay
LigandPNGBDBM70604(2-(4-ethylphenoxy)-N-[(3-ketoindan-1-ylidene)amino...)
Affinity DataIC50:  4.06E+3nM. Assay description: Data Source: Sanford-Burnham Center for Chemical Genomics (SBCCG) Source Affiliation: Sanford-Burnham Medical Research Institute (SBMRI, San Diego, C...
Ligand InfoPC cidPC sid
In DepthDetails PCBioAssay
TargetCaspase-9(Homo sapiens (Human))
Burnham Center For Chemical Genomics
Curated by PubChem BioAssay
LigandPNGBDBM70604(2-(4-ethylphenoxy)-N-[(3-ketoindan-1-ylidene)amino...)
Affinity DataIC50:  6.76E+3nM. Assay description: Data Source: Sanford-Burnham Center for Chemical Genomics (SBCCG) Source Affiliation: Sanford-Burnham Medical Research Institute (SBIMR, San Diego, C...
Ligand InfoPC cidPC sid
In DepthDetails PCBioAssay
TargetApoptotic protease-activating factor 1(Homo sapiens (Human))
Burnham Center For Chemical Genomics
Curated by PubChem BioAssay
LigandPNGBDBM70604(2-(4-ethylphenoxy)-N-[(3-ketoindan-1-ylidene)amino...)
Affinity DataIC50:  1.85E+4nM. Assay description: Data Source: Sanford-Burnham Center for Chemical Genomics (SBCCG) Source Affiliation: Sanford-Burnham Medical Research Institute (SBIMR, San Diego, C...
Ligand InfoPC cidPC sid
In DepthDetails PCBioAssay
TargetApoptotic protease-activating factor 1(Homo sapiens (Human))
Burnham Center For Chemical Genomics
Curated by PubChem BioAssay
LigandPNGBDBM70604(2-(4-ethylphenoxy)-N-[(3-ketoindan-1-ylidene)amino...)
Affinity DataIC50: >1.00E+5nM. Assay description: Data Source: Sanford-Burnham Center for Chemical Genomics (SBCCG) Source Affiliation: Sanford-Burnham Medical Research Institute (SBIMR, San Diego, C...
Ligand InfoPC cidPC sid
In DepthDetails PCBioAssay
TargetCaspase-3(Homo sapiens (Human))
Burnham Center For Chemical Genomics
Curated by PubChem BioAssay
LigandPNGBDBM70604(2-(4-ethylphenoxy)-N-[(3-ketoindan-1-ylidene)amino...)
Affinity DataIC50:  3.70E+3nM. Assay description: Data Source: Sanford-Burnham Center for Chemical Genomics (SBCCG) Source Affiliation: Sanford-Burnham Medical Research Institute (SBMRI, San Diego, C...
Ligand InfoPC cidPC sid
In DepthDetails PCBioAssay