BDBM76493 2,5-dimethyl-N-[(Z)-(1-methyl-2-oxidanylidene-indol-3-ylidene)amino]furan-3-carboxamide::2,5-dimethyl-N-[(Z)-(1-methyl-2-oxo-3-indolylidene)amino]-3-furancarboxamide::2,5-dimethyl-N-[(Z)-(1-methyl-2-oxoindol-3-ylidene)amino]furan-3-carboxamide::MLS000394970::N-[(Z)-(2-keto-1-methyl-indolin-3-ylidene)amino]-2,5-dimethyl-3-furamide::SMR000248462::cid_5790282
SMILES CN1C(=O)\C(=N/NC(=O)c2cc(C)oc2C)c2ccccc12
InChI Key InChIKey=DTBNCXOXPJGWNV-VKAVYKQESA-N
Data  3 IC50
  Tab Delimited (TSV)   2D SDfile   Computed 3D by Vconf -m prep SDfile
Find this compound or compounds like it in BindingDB:
Activity Spreadsheet -- Enzyme Inhibition Constant Data from BindingDB
Found 3 hits for monomerid = 76493
TargetSentrin-specific protease 8(Homo sapiens (Human))
Burnham Center For Chemical Genomics
Curated by PubChem BioAssay
LigandPNGBDBM76493(2,5-dimethyl-N-[(Z)-(1-methyl-2-oxidanylidene-indo...)
Affinity DataIC50: >1.00E+5nM. Assay description: Data Source: Sanford-Burnham Center for Chemical Genomics (SBCCG) Source Affiliation: Sanford-Burnham Medical Research Institute (SBMRI, San Diego, C...
In DepthDetails PCBioAssay
TargetCaspase-3(Homo sapiens (Human))
Burnham Center For Chemical Genomics
Curated by PubChem BioAssay
LigandPNGBDBM76493(2,5-dimethyl-N-[(Z)-(1-methyl-2-oxidanylidene-indo...)
Affinity DataIC50:  2.71E+3nM. Assay description: Data Source: Sanford-Burnham Center for Chemical Genomics (SBCCG) Source Affiliation: Sanford-Burnham Medical Research Institute (SBMRI, San Diego, C...
In DepthDetails PCBioAssay
TargetSentrin-specific protease 6(Homo sapiens (Human))
Burnham Center For Chemical Genomics
Curated by PubChem BioAssay
LigandPNGBDBM76493(2,5-dimethyl-N-[(Z)-(1-methyl-2-oxidanylidene-indo...)
Affinity DataIC50:  4.84E+3nM. Assay description: Data Source: Sanford-Burnham Center for Chemical Genomics (SBCCG) Source Affiliation: Sanford-Burnham Medical Research Institute (SBMRI, San Diego, C...
In DepthDetails PCBioAssay