BDBM76547 3-methyl-5-oxidanylidene-4-phenyldiazenyl-4H-pyrazole-1-carbothioamide::3-methyl-5-oxo-4-phenyldiazenyl-4H-pyrazole-1-carbothioamide::5-keto-3-methyl-4-phenylazo-2-pyrazoline-1-carbothioamide::MLS000709346::SMR000290013::cid_3103952
SMILES Cc1[nH]n(C(N)=S)c(=O)c1N=Nc1ccccc1
InChI Key InChIKey=JESNAJSWZPKMBR-BUHFOSPRSA-N
Data  3 IC50
  Tab Delimited (TSV)   2D SDfile   Computed 3D by Vconf -m prep SDfile
Find this compound or compounds like it in BindingDB:
Activity Spreadsheet -- Enzyme Inhibition Constant Data from BindingDB
Found 3 hits for monomerid = 76547
TargetCaspase-3(Homo sapiens (Human))
Burnham Center For Chemical Genomics
Curated by PubChem BioAssay
LigandPNGBDBM76547(3-methyl-5-oxidanylidene-4-phenyldiazenyl-4H-pyraz...)
Affinity DataIC50:  3.70E+3nM. Assay description: Data Source: Sanford-Burnham Center for Chemical Genomics (SBCCG) Source Affiliation: Sanford-Burnham Medical Research Institute (SBMRI, San Diego, C...
In DepthDetails PCBioAssay
TargetSentrin-specific protease 6(Homo sapiens (Human))
Burnham Center For Chemical Genomics
Curated by PubChem BioAssay
LigandPNGBDBM76547(3-methyl-5-oxidanylidene-4-phenyldiazenyl-4H-pyraz...)
Affinity DataIC50:  2.16E+4nM. Assay description: Data Source: Sanford-Burnham Center for Chemical Genomics (SBCCG) Source Affiliation: Sanford-Burnham Medical Research Institute (SBMRI, San Diego, C...
In DepthDetails PCBioAssay
TargetSentrin-specific protease 8(Homo sapiens (Human))
Burnham Center For Chemical Genomics
Curated by PubChem BioAssay
LigandPNGBDBM76547(3-methyl-5-oxidanylidene-4-phenyldiazenyl-4H-pyraz...)
Affinity DataIC50: >1.00E+5nM. Assay description: Data Source: Sanford-Burnham Center for Chemical Genomics (SBCCG) Source Affiliation: Sanford-Burnham Medical Research Institute (SBMRI, San Diego, C...
In DepthDetails PCBioAssay