BDBM76592 2-((E)-2-p-Tolyl-vinyl)-3H-quinazolin-4-one::2-[(E)-2-(4-methylphenyl)ethenyl]-1H-quinazolin-4-one::2-[(E)-2-(p-tolyl)vinyl]-1H-quinazolin-4-one::MLS000778154::SMR000414549::cid_5912184
SMILES Cc1ccc(C=Cc2nc3ccccc3c(=O)[nH]2)cc1
InChI Key InChIKey=MBJSUONJTWIBKH-ZHACJKMWSA-N
Data  4 IC50
  Tab Delimited (TSV)   2D SDfile   Computed 3D by Vconf -m prep SDfile
Find this compound or compounds like it in BindingDB:
Activity Spreadsheet -- Enzyme Inhibition Constant Data from BindingDB
Found 4 hits for monomerid = 76592
TargetCaspase-3(Homo sapiens (Human))
Burnham Center For Chemical Genomics
Curated by PubChem BioAssay
LigandPNGBDBM76592(2-((E)-2-p-Tolyl-vinyl)-3H-quinazolin-4-one | 2-[(...)
Affinity DataIC50:  999nM. Assay description: Data Source: Sanford-Burnham Center for Chemical Genomics (SBCCG) Source Affiliation: Sanford-Burnham Medical Research Institute (SBMRI, San Diego, C...
In DepthDetails PCBioAssay
TargetSentrin-specific protease 6(Homo sapiens (Human))
Burnham Center For Chemical Genomics
Curated by PubChem BioAssay
LigandPNGBDBM76592(2-((E)-2-p-Tolyl-vinyl)-3H-quinazolin-4-one | 2-[(...)
Affinity DataIC50:  961nM. Assay description: Data Source: Sanford-Burnham Center for Chemical Genomics (SBCCG) Source Affiliation: Sanford-Burnham Medical Research Institute (SBMRI, San Diego, C...
In DepthDetails PCBioAssay
TargetSentrin-specific protease 8(Homo sapiens (Human))
Burnham Center For Chemical Genomics
Curated by PubChem BioAssay
LigandPNGBDBM76592(2-((E)-2-p-Tolyl-vinyl)-3H-quinazolin-4-one | 2-[(...)
Affinity DataIC50:  403nM. Assay description: Data Source: Sanford-Burnham Center for Chemical Genomics (SBCCG) Source Affiliation: Sanford-Burnham Medical Research Institute (SBMRI, San Diego, C...
In DepthDetails PCBioAssay
TargetSentrin-specific protease 8(Homo sapiens (Human))
Burnham Center For Chemical Genomics
Curated by PubChem BioAssay
LigandPNGBDBM76592(2-((E)-2-p-Tolyl-vinyl)-3H-quinazolin-4-one | 2-[(...)
Affinity DataIC50:  1.50E+3nM. Assay description: Data Source: Sanford-Burnham Center for Chemical Genomics (SBCCG) Source Affiliation: Sanford-Burnham Medical Research Institute (SBMRI, San Diego, C...
In DepthDetails PCBioAssay