BDBM76616 3-methyl-1H-pyrazole-4,5-dione 4-[(4-bromo-3-chlorophenyl)hydrazone]::4-[(4-bromo-3-chlorophenyl)hydrazo]-5-methyl-3-pyrazolone::4-[2-(4-bromanyl-3-chloranyl-phenyl)hydrazinyl]-5-methyl-pyrazol-3-one::4-[2-(4-bromo-3-chlorophenyl)hydrazinyl]-5-methylpyrazol-3-one::4-[N'-(4-bromo-3-chloro-phenyl)hydrazino]-5-methyl-pyrazol-3-one::MLS001180104::SMR000477097::cid_5349295
SMILES Cc1[nH][nH]c(=O)c1N=Nc1ccc(Br)c(Cl)c1
InChI Key InChIKey=BWOMYVIANAUALT-UHFFFAOYSA-N
Data  3 IC50
  Tab Delimited (TSV)   2D SDfile   Computed 3D by Vconf -m prep SDfile
Find this compound or compounds like it in BindingDB:
Activity Spreadsheet -- Enzyme Inhibition Constant Data from BindingDB
Found 3 hits for monomerid = 76616
TargetCaspase-3(Homo sapiens (Human))
Burnham Center For Chemical Genomics
Curated by PubChem BioAssay
LigandPNGBDBM76616(3-methyl-1H-pyrazole-4,5-dione 4-[(4-bromo-3-chlor...)
Affinity DataIC50:  2.41E+3nM. Assay description: Data Source: Sanford-Burnham Center for Chemical Genomics (SBCCG) Source Affiliation: Sanford-Burnham Medical Research Institute (SBMRI, San Diego, C...
Ligand InfoPC cidPC sid
In DepthDetails PCBioAssay
TargetSentrin-specific protease 6(Homo sapiens (Human))
Burnham Center For Chemical Genomics
Curated by PubChem BioAssay
LigandPNGBDBM76616(3-methyl-1H-pyrazole-4,5-dione 4-[(4-bromo-3-chlor...)
Affinity DataIC50:  3.79E+3nM. Assay description: Data Source: Sanford-Burnham Center for Chemical Genomics (SBCCG) Source Affiliation: Sanford-Burnham Medical Research Institute (SBMRI, San Diego, C...
Ligand InfoPC cidPC sid
In DepthDetails PCBioAssay
TargetSentrin-specific protease 8(Homo sapiens (Human))
Burnham Center For Chemical Genomics
Curated by PubChem BioAssay
LigandPNGBDBM76616(3-methyl-1H-pyrazole-4,5-dione 4-[(4-bromo-3-chlor...)
Affinity DataIC50:  2.43E+3nM. Assay description: Data Source: Sanford-Burnham Center for Chemical Genomics (SBCCG) Source Affiliation: Sanford-Burnham Medical Research Institute (SBMRI, San Diego, C...
Ligand InfoPC cidPC sid
In DepthDetails PCBioAssay