Target
Glycogen synthase kinase-3 alpha
Ligand
BDBM8393
Substrate
Biotinylated Peptide Substrate
Meas. Tech.
Kinase Inhibition SPA Assay
IC50
99±n/a nM
Citation
 Witherington, JBordas, VGaiba, ANaylor, ARawlings, ADSlingsby, BPSmith, DGTakle, AKWard, RW 6-heteroaryl-pyrazolo[3,4-b]pyridines: potent and selective inhibitors of glycogen synthase kinase-3 (GSK-3). Bioorg Med Chem Lett 13:3059-62 (2003)  
Target
Name:
Glycogen synthase kinase-3 alpha
Synonyms:
GSK-3 alpha GSK3A_HUMAN Glycogen synthase kinase-3 Glycogen synthase kinase-3 alpha (GSK3 Alpha) Glycogen synthase kinase-3 alpha (GSK3alpha)
Type:
Enzyme
Mol. Mass.:
50991.79
Organism:
Homo sapiens (Human)
Description:
P49840
Residue:
483
  
Inhibitor
Name:
BDBM8393
Synonyms:
CHEMBL261690 pyrazolo[3,4-b]pyridine analogue 35
Type:
Small organic molecule
Emp. Form.:
C13H10BrN5OS
Mol. Mass.:
364.22
SMILES:
Brc1cc2c(NC(=O)C3CC3)n[nH]c2nc1-c1nccs1
:
Substrate
Name:
Biotinylated Peptide Substrate
Synonyms:
Type:
Peptide
Mol. Mass.:
3615.87
Organism:
Description:
Residue:
32