Target
Aromatase
Ligand
BDBM8936
Substrate
BDBM8592
Meas. Tech.
CYP17 Assay
IC50
2300±n/a nM
Citation
 Hutschenreuter, TUEhmer, PBHartmann, RW Synthesis of hydroxy derivatives of highly potent non-steroidal CYP 17 inhibitors as potential metabolites and evaluation of their activity by a non cellular assay using recombinant human enzyme. J Enzyme Inhib Med Chem 19:17-32 (2004)  
Target
Name:
Aromatase
Synonyms:
ARO1 CP19A_HUMAN CYP19 CYPXIX Cytochrome P450 19A1 Cytochrome P450-C19 (CYP19) FL cytokine receptor precursor | P-450AROM
Type:
Enzyme
Mol. Mass.:
57888.92
Organism:
Homo sapiens (Human)
Description:
P11511
Residue:
503
  
Inhibitor
Name:
BDBM8936
Synonyms:
6-(1H-imidazol-5-ylmethyl)-5-methyl-7,8-dihydronaphthalen-2-ol dihydronaphthalene derivative
Type:
Small organic molecule
Emp. Form.:
C15H16N2O
Mol. Mass.:
240.3003
SMILES:
CC1=C(Cc2cnc[nH]2)CCc2cc(O)ccc12
:
Substrate
Name:
BDBM8592
Synonyms:
(2R,15S)-2,15-dimethyltetracyclo[8.7.0.0^{2,7}.0^{11,15}]heptadec-6-ene-5,14-dione Androst-4-ene-3,17-dione [1beta-3H] androstenedione
Type:
Small organic molecule
Emp. Form.:
C19H26O2
Mol. Mass.:
286.4085
SMILES:
C[C@]12CCC3C(CCC4=CC(=O)CC[C@]34C)C1CCC2=O
: