Target
Receptor tyrosine-protein kinase erbB-2
Ligand
BDBM376927
Substrate
Meas. Tech.
In Vitro Inhibitory Activity Assay
IC50
26.0±n/a nM
Citation
 Kawai, YIrie, HSagara, TMiyadera, K Pyrazolo[3,4-d]pyrimidine compound or salt thereof US Patent  US9920060 Publication Date 3/20/2018 
Target
Name:
Receptor tyrosine-protein kinase erbB-2
Synonyms:
2.7.10.1 CD_antigen=CD340 ERBB2_HUMAN FASN/HER2 HER2 MLN19 NEU Proto-oncogene Neu Tyrosine kinase-type cell surface receptor HER2 | p185erbB2
Type:
Mol. Mass.:
137894.47
Organism:
Homo sapiens (Human)
Description:
P04626
Residue:
1255
  
Inhibitor
Name:
BDBM376927
Synonyms:
(R)-4-(1-(1-acryloylpiperidin-3-yl)-4-amino-1H-pyrazolo[3,4-d]pyrimidine-3-carboxamido)phenyldimethyl carbamate US9920060, 21
Type:
Small organic molecule
Emp. Form.:
C23H26N8O4
Mol. Mass.:
478.5037
SMILES:
CN(C)C(=O)Oc1ccc(NC(=O)c2nn([C@@H]3CCCN(C3)C(=O)C=C)c3ncnc(N)c23)cc1
: