Target
Plasminogen
Ligand
BDBM23869
Substrate
BDBM23923
Meas. Tech.
Determination of Inhibition Constants
Ki
440±n/a nM
Citation
 Steinmetzer, TSchweinitz, AStürzebecher, ADönnecke, DUhland, KSchuster, OSteinmetzer, PMüller, FFriedrich, RThan, MEBode, WStürzebecher, J Secondary amides of sulfonylated 3-amidinophenylalanine. New potent and selective inhibitors of matriptase. J Med Chem 49:4116-26 (2006)  
Target
Name:
Plasminogen
Synonyms:
Activation peptide PLG Plasmin Plasmin heavy chain A, short form | Plasmin light chain B
Type:
Enzyme
Mol. Mass.:
90579.18
Organism:
Homo sapiens (Human)
Description:
Residue:
810
  
Inhibitor
Name:
BDBM23869
Synonyms:
3-[(2S)-3-[4-(3-aminopropanoyl)piperazin-1-yl]-3-oxo-2-{[2,4,6-tris(propan-2-yl)benzene]sulfonamido}propyl]benzene-1-carboximidamide | 3-amidinophenylalanine deriv., 13
Type:
Small organic molecule
Emp. Form.:
C32H48N6O4S
Mol. Mass.:
612.826
SMILES:
CC(C)c1cc(C(C)C)c(c(c1)C(C)C)S(=O)(=O)N[C@@H](Cc1cccc(c1)C(N)=N)C(=O)N1CCN(CC1)C(=O)CCN
:
Substrate
Name:
BDBM23923
Synonyms:
Tos-Gly-Pro-Lys-pNA | tosyl-glycyl-L-prolyl-L-lysine p-nitroanilide
Type:
Emp. Form.:
Mol. Mass.:
SMILES:
: