Target
Tyrosine-protein kinase receptor UFO
Ligand
BDBM27908
Substrate
polyGlu4Tyr
Meas. Tech.
Axl Enzyme Inhibition Assay
Temperature
298.15±n/a K
IC50
>500±n/a nM
Comments
extracted
Citation
 Huang, HHutta, DARinker, JMHu, HParsons, WHSchubert, CDesjarlais, RLCrysler, CSChaikin, MADonatelli, RRChen, YCheng, DZhou, ZYurkow, EManthey, CLPlayer, MR Pyrido[2,3-d]pyrimidin-5-ones: A Novel Class of Antiinflammatory Macrophage Colony-Stimulating Factor-1 Receptor Inhibitors (dagger). J Med Chem 52:1081-99 (2009)  
Target
Name:
Tyrosine-protein kinase receptor UFO
Synonyms:
AXL TEL/AXL UFO | UFO_HUMAN
Type:
Enzyme
Mol. Mass.:
98316.97
Organism:
Homo sapiens (Human)
Description:
P30530
Residue:
894
  
Inhibitor
Name:
BDBM27908
Synonyms:
2-[4-(4-{[8-(2,3-dihydro-1H-inden-5-yl)-6-(methoxycarbamoyl)-5-oxo-5H,8H-pyrido[2,3-d]pyrimidin-2-yl]amino}phenyl)piperidin-1-yl]acetic acid | Pyrido[2,3-d]pyrimidin-5-one, 36
Type:
Small organic molecule
Emp. Form.:
C31H32N6O5
Mol. Mass.:
568.623
SMILES:
CONC(=O)c1cn(-c2ccc3CCCc3c2)c2nc(Nc3ccc(cc3)C3CCN(CC(O)=O)CC3)ncc2c1=O
:
Substrate
Name:
polyGlu4Tyr
Synonyms:
Type:
Random copolymer
Mol. Mass.:
358.43
Organism:
Description:
Residue:
3
NA