Target
Macrophage colony-stimulating factor 1 receptor
Ligand
BDBM50240227
Substrate
Meas. Tech.
ChEMBL_1667795 (CHEMBL4017683)
IC50
0.500000±n/a nM
Citation
 Ramachandran, SAJadhavar, PSMiglani, SKSingh, MPKalane, DPAgarwal, AKSathe, BDMukherjee, KGupta, AHaldar, SRaja, MSingh, SPham, SMChakravarty, SQuinn, KBelmar, SAlfaro, IEHiggs, CBernales, SHerrera, FJRai, R Design, synthesis and optimization of bis-amide derivatives as CSF1R inhibitors. Bioorg Med Chem Lett 27:2153-2160 (2017)  
Target
Name:
Macrophage colony-stimulating factor 1 receptor
Synonyms:
CSF1R FMS Macrophage colony stimulating factor receptor Macrophage colony-stimulating factor 1 receptor (c-FMS) Proto-oncogene c-Fms c-fms | cFMS
Type:
Protein
Mol. Mass.:
107979.48
Organism:
Homo sapiens (Human)
Description:
P07333
Residue:
972
  
Inhibitor
Name:
BDBM50240227
Synonyms:
CHEMBL4084391
Type:
Small organic molecule
Emp. Form.:
C25H20F3N5O2
Mol. Mass.:
479.4538
SMILES:
Cc1ccc(NC(=O)c2cccc(c2)C(F)(F)F)cc1NC(=O)c1cncc(c1)-c1cnn(C)c1
: