Target
Beta-secretase 1
Ligand
BDBM50042944
Substrate
Meas. Tech.
ChEBML_1672338
IC50
51500±n/a nM
Citation
 Le, TCYim, CYPark, SKatila, NYang, ISong, MCYoon, YJChoi, DYChoi, HNam, SJFenical, W Lodopyridones B and C from a marine sediment-derived bacterium Saccharomonospora sp. Bioorg Med Chem Lett 27:3123-3126 (2017)  
Target
Name:
Beta-secretase 1
Synonyms:
ASP2 Aspartyl protease 2 BACE1 Beta-secretase (BACE) Beta-secretase 1 (BACE 1) Beta-secretase 1 (BACE1) Beta-site amyloid precursor protein cleaving enzyme 1 Memapsin-2 beta-Secretase (BACE-1) | beta-Secretase (BACE1)
Type:
Protein
Mol. Mass.:
55755.10
Organism:
Homo sapiens (Human)
Description:
P56817
Residue:
501
  
Inhibitor
Name:
BDBM50042944
Synonyms:
(E)-1-(2,4-Dihydroxy-phenyl)-3-(4-hydroxy-phenyl)-propenone 1-(2,4-Dihydroxy-phenyl)-3-(4-hydroxy-phenyl)-propenone 1-(2,4-dihydroxyphenyl)-3-(4-hydroxyphenyl)prop-2-en-1-one 2',4,4'-trihydroxychalcone CHEMBL129795 cid_638278
Type:
Small organic molecule
Emp. Form.:
C15H12O4
Mol. Mass.:
256.2534
SMILES:
Oc1ccc(\C=C\C(=O)c2ccc(O)cc2O)cc1
: