Target
D(2) dopamine receptor
Ligand
BDBM50020178
Substrate
Meas. Tech.
ChEMBL_62255 (CHEMBL675482)
Ki
5.3±n/a nM
Citation
 Kuipers, WKruse, CGvan Wijngaarden, IStandaar, PJTulp, MTVeldman, NSpek, ALIJzerman, AP 5-HT1A-versus D2-receptor selectivity of flesinoxan and analogous N4-substituted N1-arylpiperazines. J Med Chem 40:300-12 (1997)  
Target
Name:
D(2) dopamine receptor
Synonyms:
DOPAMINE D2 DOPAMINE D2 Short Dopamine D2 receptor Drd2
Type:
G Protein-Coupled Receptor (GPCR)
Mol. Mass.:
50931.60
Organism:
Rattus norvegicus (rat)
Description:
P61169
Residue:
444
  
Inhibitor
Name:
BDBM50020178
Synonyms:
CHEMBL294633 N-[2-(4-Benzofuran-7-yl-piperazin-1-yl)-ethyl]-4-fluoro-benzamide
Type:
Small organic molecule
Emp. Form.:
C21H22FN3O2
Mol. Mass.:
367.4167
SMILES:
Fc1ccc(cc1)C(=O)NCCN1CCN(CC1)c1cccc2ccoc12
: