Target
Tyrosine-protein kinase Lck
Ligand
BDBM16316
Substrate
Meas. Tech.
ChEMBL_429711 (CHEMBL904285)
IC50
>10000±n/a nM
Citation
 Leftheris, KAhmed, GChan, RDyckman, AJHussain, ZHo, KHynes, JLetourneau, JLi, WLin, SMetzger, AMoriarty, KJRiviello, CShimshock, YWen, JWityak, JWrobleski, STWu, HWu, JDesai, MGillooly, KMLin, THLoo, DMcIntyre, KWPitt, SShen, DRShuster, DJZhang, RDiller, DDoweyko, ASack, JBaldwin, JBarrish, JDodd, JHenderson, IKanner, SSchieven, GLWebb, M The discovery of orally active triaminotriazine aniline amides as inhibitors of p38 MAP kinase. J Med Chem 47:6283-91 (2004)  
Target
Name:
Tyrosine-protein kinase Lck
Synonyms:
2.7.10.2 LCK_HUMAN Leukocyte C-terminal Src kinase Lymphocyte-specific protein tyrosine kinase Protein YT16 Proto-oncogene tyrosine-protein kinase LCK T cell-specific protein-tyrosine kinase
Type:
Mol. Mass.:
57987.83
Organism:
Homo sapiens (Human)
Description:
P06239
Residue:
509
  
Inhibitor
Name:
BDBM16316
Synonyms:
3-({4-[(2,2-dimethylpropyl)(methyl)amino]-6-(4-methyl-1,4-diazepan-1-yl)-1,3,5-triazin-2-yl}amino)-N-methoxy-4-methylbenzamide triaminotriazine aniline amide inhibitor, 1
Type:
Small organic molecule
Emp. Form.:
C24H38N8O2
Mol. Mass.:
470.6109
SMILES:
CONC(=O)c1ccc(C)c(Nc2nc(nc(n2)N2CCCN(C)CC2)N(C)CC(C)(C)C)c1
: