Target
Mitogen-activated protein kinase 14
Ligand
BDBM50156749
Substrate
Meas. Tech.
ChEMBL_429695 (CHEMBL904269)
IC50
227±n/a nM
Citation
 Leftheris, KAhmed, GChan, RDyckman, AJHussain, ZHo, KHynes, JLetourneau, JLi, WLin, SMetzger, AMoriarty, KJRiviello, CShimshock, YWen, JWityak, JWrobleski, STWu, HWu, JDesai, MGillooly, KMLin, THLoo, DMcIntyre, KWPitt, SShen, DRShuster, DJZhang, RDiller, DDoweyko, ASack, JBaldwin, JBarrish, JDodd, JHenderson, IKanner, SSchieven, GLWebb, M The discovery of orally active triaminotriazine aniline amides as inhibitors of p38 MAP kinase. J Med Chem 47:6283-91 (2004)  
Target
Name:
Mitogen-activated protein kinase 14
Synonyms:
CSAID-binding protein CSBP1 CSPB1 MAP kinase 14 MAP kinase p38 alpha MAPK14 MK14_HUMAN Mitogen-activated protein kinase p38 alpha Stress-activated protein kinase 2a | p38 MAP kinase alpha/beta
Type:
Serine/threonine-protein kinase
Mol. Mass.:
41286.76
Organism:
Homo sapiens (Human)
Description:
Q16539
Residue:
360
  
Inhibitor
Name:
BDBM50156749
Synonyms:
(S)-3-(4-(4-fluorophenethylamino)-6-(pyrrolidin-3-ylamino)-1,3,5-triazin-2-ylamino)-4-methylbenzamide | CHEMBL224957
Type:
Small organic molecule
Emp. Form.:
C23H27FN8O
Mol. Mass.:
450.5119
SMILES:
Cc1ccc(cc1Nc1nc(NCCc2ccc(F)cc2)nc(N[C@H]2CCNC2)n1)C(N)=O
: