Target
Mitogen-activated protein kinase 14
Ligand
BDBM50156738
Substrate
Meas. Tech.
ChEMBL_429695 (CHEMBL904269)
IC50
52±n/a nM
Citation
 Leftheris, KAhmed, GChan, RDyckman, AJHussain, ZHo, KHynes, JLetourneau, JLi, WLin, SMetzger, AMoriarty, KJRiviello, CShimshock, YWen, JWityak, JWrobleski, STWu, HWu, JDesai, MGillooly, KMLin, THLoo, DMcIntyre, KWPitt, SShen, DRShuster, DJZhang, RDiller, DDoweyko, ASack, JBaldwin, JBarrish, JDodd, JHenderson, IKanner, SSchieven, GLWebb, M The discovery of orally active triaminotriazine aniline amides as inhibitors of p38 MAP kinase. J Med Chem 47:6283-91 (2004)  
Target
Name:
Mitogen-activated protein kinase 14
Synonyms:
CSAID-binding protein CSBP1 CSPB1 MAP kinase 14 MAP kinase p38 alpha MAPK14 MK14_HUMAN Mitogen-activated protein kinase p38 alpha Stress-activated protein kinase 2a | p38 MAP kinase alpha/beta
Type:
Serine/threonine-protein kinase
Mol. Mass.:
41286.76
Organism:
Homo sapiens (Human)
Description:
Q16539
Residue:
360
  
Inhibitor
Name:
BDBM50156738
Synonyms:
3-(4-(1,4-diazepan-1-yl)-6-(methyl(neopentyl)amino)-1,3,5-triazin-2-ylamino)-N-methoxy-4-methylbenzamide | CHEMBL225089
Type:
Small organic molecule
Emp. Form.:
C23H36N8O2
Mol. Mass.:
456.5843
SMILES:
CONC(=O)c1ccc(C)c(Nc2nc(nc(n2)N2CCCNCC2)N(C)CC(C)(C)C)c1
: