Target
Mitogen-activated protein kinase 14
Ligand
BDBM50156755
Substrate
Meas. Tech.
ChEMBL_429695 (CHEMBL904269)
IC50
31±n/a nM
Citation
 Leftheris, KAhmed, GChan, RDyckman, AJHussain, ZHo, KHynes, JLetourneau, JLi, WLin, SMetzger, AMoriarty, KJRiviello, CShimshock, YWen, JWityak, JWrobleski, STWu, HWu, JDesai, MGillooly, KMLin, THLoo, DMcIntyre, KWPitt, SShen, DRShuster, DJZhang, RDiller, DDoweyko, ASack, JBaldwin, JBarrish, JDodd, JHenderson, IKanner, SSchieven, GLWebb, M The discovery of orally active triaminotriazine aniline amides as inhibitors of p38 MAP kinase. J Med Chem 47:6283-91 (2004)  
Target
Name:
Mitogen-activated protein kinase 14
Synonyms:
CSAID-binding protein CSBP1 CSPB1 MAP kinase 14 MAP kinase p38 alpha MAPK14 MK14_HUMAN Mitogen-activated protein kinase p38 alpha Stress-activated protein kinase 2a | p38 MAP kinase alpha/beta
Type:
Serine/threonine-protein kinase
Mol. Mass.:
41286.76
Organism:
Homo sapiens (Human)
Description:
Q16539
Residue:
360
  
Inhibitor
Name:
BDBM50156755
Synonyms:
(S)-N-ethyl-4-methyl-3-(4-(methyl(neopentyl)amino)-6-(pyrrolidin-3-ylamino)-1,3,5-triazin-2-ylamino)benzamide | CHEMBL222267
Type:
Small organic molecule
Emp. Form.:
C23H36N8O
Mol. Mass.:
440.5849
SMILES:
CCNC(=O)c1ccc(C)c(Nc2nc(N[C@H]3CCNC3)nc(n2)N(C)CC(C)(C)C)c1
: