Target
Alkaline phosphatase, tissue-nonspecific isozyme
Ligand
BDBM50253959
Substrate
Meas. Tech.
ChEMBL_559237 (CHEMBL1014656)
IC50
56±n/a nM
Citation
 Sidique, SArdecky, RSu, YNarisawa, SBrown, BMillán, JLSergienko, ECosford, ND Design and synthesis of pyrazole derivatives as potent and selective inhibitors of tissue-nonspecific alkaline phosphatase (TNAP). Bioorg Med Chem Lett 19:222-5 (2008)  
Target
Name:
Alkaline phosphatase, tissue-nonspecific isozyme
Synonyms:
ALPL tissue-nonspecific alkaline phosphatase precursor
Type:
PROTEIN
Mol. Mass.:
57306.17
Organism:
Homo sapiens (Human)
Description:
ChEMBL_1448917
Residue:
524
  
Inhibitor
Name:
BDBM50253959
Synonyms:
3-(2,4-dichloro-5-fluorophenyl)-N-(3-hydroxypropyl)-1H-pyrazole-5-carboxamide cid_24178184
Type:
Small organic molecule
Emp. Form.:
C13H12Cl2FN3O2
Mol. Mass.:
332.158
SMILES:
OCCCNC(=O)c1cc(n[nH]1)-c1cc(F)c(Cl)cc1Cl
: