Target
Mitogen-activated protein kinase 11
Ligand
BDBM50344123
Substrate
Meas. Tech.
ChEMBL_747813 (CHEMBL1781012)
Kd
25±n/a nM
Citation
 Soth, MAbbot, SAbubakari, AArora, NArzeno, HBilledeau, RDewdney, NDurkin, KFrauchiger, SGhate, MGoldstein, DMHill, RJKuglstatter, ALi, FLoe, BMcCaleb, KMcIntosh, JPapp, EPark, JStahl, MSung, MLSuttman, RSwinney, DCWeller, PWong, BZecic, HGabriel, T 3-Amino-pyrazolo[3,4-d]pyrimidines as p38a kinase inhibitors: design and development to a highly selective lead. Bioorg Med Chem Lett 21:3452-6 (2011)  
Target
Name:
Mitogen-activated protein kinase 11
Synonyms:
MAP kinase p38 MK11_HUMAN Mitogen-activated protein kinase p38 beta SAPK2 Stress-activated protein kinase 2 p38-2 p38b
Type:
Enzyme Catalytic Domain
Mol. Mass.:
41351.73
Organism:
Homo sapiens (Human)
Description:
gi_20128774
Residue:
364
  
Inhibitor
Name:
BDBM50344123
Synonyms:
(R)-6-(2,4-difluorophenoxy)-N-(1-(methylsulfonyl)propan-2-yl)-1H-pyrazolo[3,4-d]pyrimidin-3-amine CHEMBL1236810
Type:
Small organic molecule
Emp. Form.:
C15H15F2N5O3S
Mol. Mass.:
383.373
SMILES:
C[C@H](CS(C)(=O)=O)Nc1[nH]nc2nc(Oc3ccc(F)cc3F)ncc12
: