Target
Prostaglandin G/H synthase 1
Ligand
BDBM50326129
Substrate
Meas. Tech.
ChEMBL_800323 (CHEMBL1948169)
IC50
10±n/a nM
Citation
 Arisawa, MKasaya, YObata, TSasaki, TIto, MAbe, HIto, YYamano, AShuto, S Indomethacin Analogues that Enhance Doxorubicin Cytotoxicity in Multidrug Resistant Cells without Cox Inhibitory Activity. ACS Med Chem Lett 2:353-357 (2011)  
Target
Name:
Prostaglandin G/H synthase 1
Synonyms:
COX-1 Cyclooxygenase Cyclooxygenase-1 (COX-1) PTGS1 | Prostaglandin G/H synthase (cyclooxygenase)
Type:
Enzyme
Mol. Mass.:
68692.62
Organism:
Homo sapiens (Human)
Description:
P23219
Residue:
599
  
Inhibitor
Name:
BDBM50326129
Synonyms:
Indometacin
Type:
Small organic molecule
Emp. Form.:
C18H14ClNO3
Mol. Mass.:
327.762
SMILES:
Cc1c(CC(O)=O)c2ccccc2n1C(=O)c1ccc(Cl)cc1
: