Target
Prostaglandin G/H synthase 2
Ligand
BDBM50362893
Substrate
Meas. Tech.
ChEMBL_800325 (CHEMBL1948171)
IC50
>400000±n/a nM
Citation
 Arisawa, MKasaya, YObata, TSasaki, TIto, MAbe, HIto, YYamano, AShuto, S Indomethacin Analogues that Enhance Doxorubicin Cytotoxicity in Multidrug Resistant Cells without Cox Inhibitory Activity. ACS Med Chem Lett 2:353-357 (2011)  
Target
Name:
Prostaglandin G/H synthase 2
Synonyms:
COX2 Cyclooxygenase 2 (COX-2) Cyclooxygenase-2 (COX-2 AA) Cyclooxygenase-2 (COX-2) PGH2_HUMAN PHS II Prostaglandin E synthase/G/H synthase 2 Prostaglandin-endoperoxide synthase 2
Type:
Enzyme
Mol. Mass.:
69003.89
Organism:
Homo sapiens (Human)
Description:
Recombinant Cox-2 provided by Cayman (Cayman Chemical Co.,Ann Arbor, MI).
Residue:
604
  
Inhibitor
Name:
BDBM50362893
Synonyms:
CHEMBL1946565
Type:
Small organic molecule
Emp. Form.:
C19H16ClNO3
Mol. Mass.:
341.788
SMILES:
CCc1c(CC(O)=O)c2ccccc2n1C(=O)c1ccc(Cl)cc1
: