Target
Prothrombin
Ligand
BDBM50291169
Substrate
Meas. Tech.
ChEBML_208134
IC50
>1000000±n/a nM
Citation
 Akiyama, YTsutsumi, SHatsushiba, EOhuchi, SOkonogi, T Peptidyl -keto thiazole as potent thrombin inhibitors Bioorg Med Chem Lett 7:533-538 (1997)    Article 
Target
Name:
Prothrombin
Synonyms:
Activation peptide fragment 1 Coagulation factor II Prothrombin precursor Thrombin heavy chain | Thrombin light chain
Type:
Protein
Mol. Mass.:
70029.57
Organism:
Homo sapiens (Human)
Description:
P00734
Residue:
622
  
Inhibitor
Name:
BDBM50291169
Synonyms:
(S)-1-(4-Phenyl-butyryl)-pyrrolidine-2-carboxylic acid [(S)-2-methyl-1-(thiazole-2-carbonyl)-propyl]-amide | CHEMBL150617
Type:
Small organic molecule
Emp. Form.:
C23H29N3O3S
Mol. Mass.:
427.56
SMILES:
CC(C)[C@H](NC(=O)[C@@H]1CCCN1C(=O)CCCc1ccccc1)C(=O)c1nccs1
: