Target
Prothrombin
Ligand
BDBM50118720
Substrate
Meas. Tech.
ChEMBL_208329 (CHEMBL813561)
Ki
1.4±n/a nM
Citation
 Adang, AEde Man, APVogel, GMGrootenhuis, PDSmit, MJPeters, CAVisser, ARewinkel, JBvan Dinther, TLucas, HKelder, Jvan Aelst, SMeuleman, DGvan Boeckel, CA Unique overlap in the prerequisites for thrombin inhibition and oral bioavailability resulting in potent oral antithrombotics. J Med Chem 45:4419-32 (2002)  
Target
Name:
Prothrombin
Synonyms:
Activation peptide fragment 1 Coagulation factor II Prothrombin precursor Thrombin heavy chain | Thrombin light chain
Type:
Protein
Mol. Mass.:
70029.57
Organism:
Homo sapiens (Human)
Description:
P00734
Residue:
622
  
Inhibitor
Name:
BDBM50118720
Synonyms:
7-Amino-3-{[1-(2-amino-3-phenyl-propionyl)-pyrrolidine-2-carbonyl]-amino}-2-oxo-heptanoic acid | CHEMBL139280
Type:
Small organic molecule
Emp. Form.:
C21H30N4O5
Mol. Mass.:
418.4867
SMILES:
NCCCC[C@H](NC(=O)[C@@H]1CCCN1C(=O)[C@H](N)Cc1ccccc1)C(=O)C(O)=O
: