Target
Histone deacetylase 8
Ligand
BDBM36184
Substrate
Meas. Tech.
ChEMBL_718471 (CHEMBL1680135)
IC50
93000±n/a nM
Citation
 Fass, DMShah, RGhosh, BHennig, KNorton, SZhao, WNReis, SAKlein, PSMazitschek, RMaglathlin, RLLewis, TAHaggarty, SJ Effect of Inhibiting Histone Deacetylase with Short-Chain Carboxylic Acids and Their Hydroxamic Acid Analogs on Vertebrate Development and Neuronal Chromatin. ACS Med Chem Lett 2:39-42 (2011)  
Target
Name:
Histone deacetylase 8
Synonyms:
HD8 HDAC8_HUMAN Histone deacetylase 8 (HDAC-8) | Human HDAC8
Type:
Enzyme
Mol. Mass.:
41749.60
Organism:
Homo sapiens (Human)
Description:
Q9BY41
Residue:
377
  
Inhibitor
Name:
BDBM36184
Synonyms:
4-phenylbutanoate
Type:
Guest
Emp. Form.:
C10H11O2
Mol. Mass.:
163.1937
SMILES:
[O-]C(=O)CCCc1ccccc1
: