Target
Histone deacetylase 6
Ligand
BDBM36184
Substrate
Meas. Tech.
ChEMBL_718476 (CHEMBL1680140)
IC50
240000±n/a nM
Citation
 Fass, DMShah, RGhosh, BHennig, KNorton, SZhao, WNReis, SAKlein, PSMazitschek, RMaglathlin, RLLewis, TAHaggarty, SJ Effect of Inhibiting Histone Deacetylase with Short-Chain Carboxylic Acids and Their Hydroxamic Acid Analogs on Vertebrate Development and Neuronal Chromatin. ACS Med Chem Lett 2:39-42 (2011)  
Target
Name:
Histone deacetylase 6
Synonyms:
Cereblon/Histone deacetylase 6 HDAC6 Histone deacetylase 6 (HDAC6) KIAA0901 | ORF Names:JM21
Type:
Chromatin regulator; hydrolase; repressor
Mol. Mass.:
131381.51
Organism:
Homo sapiens (Human)
Description:
Q9UBN7
Residue:
1215
  
Inhibitor
Name:
BDBM36184
Synonyms:
4-phenylbutanoate
Type:
Guest
Emp. Form.:
C10H11O2
Mol. Mass.:
163.1937
SMILES:
[O-]C(=O)CCCc1ccccc1
: