Target
Non-lysosomal glucosylceramidase
Ligand
BDBM18355
Substrate
Meas. Tech.
ChEMBL_809645 (CHEMBL2015864)
IC50
230±n/a nM
Citation
 van den Berg, RJWennekes, TGhisaidoobe, ADonker-Koopman, WEStrijland, ABoot, RGvan der Marel, GAAerts, JMOverkleeft, HS Assessment of partially deoxygenated deoxynojirimycin derivatives as glucosylceramide synthase inhibitors. ACS Med Chem Lett 2:519-522 (2011)  
Target
Name:
Non-lysosomal glucosylceramidase
Synonyms:
Beta-glucosidase GBA2_HUMAN SPG46
Type:
PROTEIN
Mol. Mass.:
104639.04
Organism:
Homo sapiens (Human)
Description:
ChEMBL_1435476
Residue:
927
  
Inhibitor
Name:
BDBM18355
Synonyms:
(2R,3R,4R,5S)-1-butyl-2-(hydroxymethyl)piperidine-3,4,5-triol MIGLUSTAT US20230339856, Compound NB-DNJ | US9181184, 5
Type:
Small organic molecule
Emp. Form.:
C10H21NO4
Mol. Mass.:
219.278
SMILES:
CCCCN1C[C@H](O)[C@@H](O)[C@H](O)[C@H]1CO
: