Target
Polyunsaturated fatty acid 5-lipoxygenase
Ligand
BDBM50323700
Substrate
Meas. Tech.
ChEMBL_852006 (CHEMBL2157131)
IC50
3000±n/a nM
Citation
 Lachance, HWetzel, SKumar, KWaldmann, H Charting, navigating, and populating natural product chemical space for drug discovery. J Med Chem 55:5989-6001 (2012)  
Target
Name:
Polyunsaturated fatty acid 5-lipoxygenase
Synonyms:
5-LO 5-Lipoxygenase (5-LO) 5-Lipoygenase ALOX5 LOG5 | LOX5_HUMAN
Type:
Enzyme
Mol. Mass.:
77972.74
Organism:
Homo sapiens (Human)
Description:
Recombinant protein was purified from E. coli lysate. After ammonium sulfate precipitation and subsequent steps, the supernatant (S100) was used for 5-LO activity assay.
Residue:
674
  
Inhibitor
Name:
BDBM50323700
Synonyms:
CHEMBL1213616 | N-(2-(dimethylamino)ethyl)-4-((naphthalen-2-yloxy)methyl)benzamide
Type:
Small organic molecule
Emp. Form.:
C22H24N2O2
Mol. Mass.:
348.4382
SMILES:
CN(C)CCNC(=O)c1ccc(COc2ccc3ccccc3c2)cc1
: