Target
Beta-secretase 1
Ligand
BDBM50397733
Substrate
Meas. Tech.
ChEMBL_874329 (CHEMBL2182237)
IC50
2000±n/a nM
Citation
 Efremov, IVVajdos, FFBorzilleri, KACapetta, SChen, HDorff, PHDutra, JKGoldstein, SWMansour, MMcColl, ANoell, SOborski, CEO'Connell, TNO'Sullivan, TJPandit, JWang, HWei, BWithka, JM Discovery and optimization of a novel spiropyrrolidine inhibitor ofß-secretase (BACE1) through fragment-based drug design. J Med Chem 55:9069-88 (2012)  
Target
Name:
Beta-secretase 1
Synonyms:
ASP2 Aspartyl protease 2 BACE1 Beta-secretase (BACE) Beta-secretase 1 (BACE 1) Beta-secretase 1 (BACE1) Beta-site amyloid precursor protein cleaving enzyme 1 Memapsin-2 beta-Secretase (BACE-1) | beta-Secretase (BACE1)
Type:
Protein
Mol. Mass.:
55755.10
Organism:
Homo sapiens (Human)
Description:
P56817
Residue:
501
  
Inhibitor
Name:
BDBM50397733
Synonyms:
CHEMBL2181982
Type:
Small organic molecule
Emp. Form.:
C20H16BrN3O3
Mol. Mass.:
426.263
SMILES:
Brc1cc(COC(=O)[C@H]2C[C@]3(CN2)C(=O)Nc2ccccc32)ccc1C#N
: