Target
Beta-secretase 1
Ligand
BDBM50397730
Substrate
Meas. Tech.
ChEMBL_874329 (CHEMBL2182237)
IC50
11000±n/a nM
Citation
 Efremov, IVVajdos, FFBorzilleri, KACapetta, SChen, HDorff, PHDutra, JKGoldstein, SWMansour, MMcColl, ANoell, SOborski, CEO'Connell, TNO'Sullivan, TJPandit, JWang, HWei, BWithka, JM Discovery and optimization of a novel spiropyrrolidine inhibitor ofß-secretase (BACE1) through fragment-based drug design. J Med Chem 55:9069-88 (2012)  
Target
Name:
Beta-secretase 1
Synonyms:
ASP2 Aspartyl protease 2 BACE1 Beta-secretase (BACE) Beta-secretase 1 (BACE 1) Beta-secretase 1 (BACE1) Beta-site amyloid precursor protein cleaving enzyme 1 Memapsin-2 beta-Secretase (BACE-1) | beta-Secretase (BACE1)
Type:
Protein
Mol. Mass.:
55755.10
Organism:
Homo sapiens (Human)
Description:
P56817
Residue:
501
  
Inhibitor
Name:
BDBM50397730
Synonyms:
CHEMBL2181985
Type:
Small organic molecule
Emp. Form.:
C19H21N3O3
Mol. Mass.:
339.3883
SMILES:
O=C(OC1(CCCCC1)C#N)[C@H]1C[C@]2(CN1)C(=O)Nc1ccccc21
: