Target
NAD-dependent protein deacetylase sirtuin-1
Ligand
BDBM50400734
Substrate
Meas. Tech.
ChEMBL_880332 (CHEMBL2209187)
IC50
3500±n/a nM
Citation
 Maurer, BRumpf, TScharfe, MStolfa, DASchmitt, MLHe, WVerdin, ESippl, WJung, M Inhibitors of the NAD(+)-Dependent Protein Desuccinylase and Demalonylase Sirt5. ACS Med Chem Lett 3:1050-1053 (2012)  
Target
Name:
NAD-dependent protein deacetylase sirtuin-1
Synonyms:
NAD-Dependent Deacetylase Sirtuin-1 NAD-dependent protein deacetylase sirtuin-1 (SIRT1) SIR2-like protein 1 SIRT1 Sirtuin-1 (SIRT1) | hSIR2
Type:
Developmental protein; hydrolase
Mol. Mass.:
81626.66
Organism:
Homo sapiens (Human)
Description:
Residue:
747
  
Inhibitor
Name:
BDBM50400734
Synonyms:
CHEMBL1591531
Type:
Small organic molecule
Emp. Form.:
C25H23N5O2S
Mol. Mass.:
457.547
SMILES:
Cn1cc(C2=C(C(=O)NC2=O)c2cn(CCCSC(N)=N)c3ccccc23)c2ccccc12
: