Target
NAD-dependent protein deacetylase sirtuin-2
Ligand
BDBM50400734
Substrate
Meas. Tech.
ChEMBL_880333 (CHEMBL2209188)
IC50
800±n/a nM
Citation
 Maurer, BRumpf, TScharfe, MStolfa, DASchmitt, MLHe, WVerdin, ESippl, WJung, M Inhibitors of the NAD(+)-Dependent Protein Desuccinylase and Demalonylase Sirt5. ACS Med Chem Lett 3:1050-1053 (2012)  
Target
Name:
NAD-dependent protein deacetylase sirtuin-2
Synonyms:
NAD-Dependent Deacetylase Sirtuin-2 NAD-dependent deacetylase sirtuin 3 SIR2-like SIR2L SIR2_HUMAN Sirtuin 2 (SIRT2)
Type:
Hydrolase
Mol. Mass.:
43172.62
Organism:
Homo sapiens (Human)
Description:
Residue:
389
  
Inhibitor
Name:
BDBM50400734
Synonyms:
CHEMBL1591531
Type:
Small organic molecule
Emp. Form.:
C25H23N5O2S
Mol. Mass.:
457.547
SMILES:
Cn1cc(C2=C(C(=O)NC2=O)c2cn(CCCSC(N)=N)c3ccccc23)c2ccccc12
: