Target
Neuropeptide S receptor
Ligand
BDBM50412700
Substrate
Meas. Tech.
ChEMBL_559838 (CHEMBL1021519)
EC50
70.79±n/a nM
Citation
 Guerrini, RCamarda, VTrapella, CCalò, GRizzi, ARuzza, CFiorini, SMarzola, EReinscheid, RKRegoli, DSalvadori, S Synthesis and biological activity of human neuropeptide S analogues modified in position 5: identification of potent and pure neuropeptide S receptor antagonists. J Med Chem 52:524-9 (2009)  
Target
Name:
Neuropeptide S receptor
Synonyms:
Gpr154 Npsr1 | Pgr14
Type:
PROTEIN
Mol. Mass.:
42447.53
Organism:
Mus musculus
Description:
ChEMBL_445691
Residue:
371
  
Inhibitor
Name:
BDBM50412700
Synonyms:
CHEMBL526492
Type:
Small organic molecule
Emp. Form.:
C94H157N31O28S2
Mol. Mass.:
2233.573
SMILES:
[#6]-[#16]-[#6]-[#6]-[#6@H](-[#7]-[#6](=O)-[#6]-[#7]-[#6](=O)-[#6@@H](-[#7]-[#6](=O)-[#6]-[#7]-[#6](=O)-[#6@@H](-[#7]-[#6](=O)-[#6@@H](-[#6]-[#16])-[#7]-[#6](=O)-[#6@H](-[#6]-[#6](-[#7])=O)-[#7]-[#6](=O)-[#6@H](-[#6]-[#6]-[#6]\[#7]=[#6](/[#7])-[#7])-[#7]-[#6](=O)-[#6@H](-[#6]-c1ccccc1)-[#7]-[#6](=O)-[#6@@H](-[#7])-[#6]-[#8])-[#6](-[#6])-[#6])-[#6@@H](-[#6])-[#8])-[#6](=O)-[#7]-[#6@@H](-[#6]-[#6]-[#6]-[#6]-[#7])-[#6](=O)-[#7]-[#6@@H](-[#6]-[#6]-[#6]-[#6]-[#7])-[#6](=O)-[#7]-[#6@@H](-[#6@@H](-[#6])-[#8])-[#6](=O)-[#7]-[#6@@H](-[#6]-[#8])-[#6](=O)-[#7]-[#6@@H](-[#6]-c1ccccc1)-[#6](=O)-[#7]-[#6@@H](-[#6]-[#6]-[#6](-[#7])=O)-[#6](=O)-[#7]-[#6@@H](-[#6]-[#6]-[#6]\[#7]=[#6](/[#7])-[#7])-[#6](=O)-[#7]-[#6@@H](-[#6])-[#6](=O)-[#7]-[#6@@H](-[#6]-[#6]-[#6]-[#6]-[#7])-[#6](=O)-[#7]-[#6@@H](-[#6]-[#8])-[#6](-[#8])=O
: