Target
Neuropeptide S receptor
Ligand
BDBM50413780
Substrate
Meas. Tech.
ChEMBL_523542 (CHEMBL1001556)
EC50
2692±n/a nM
Citation
 Guerrini, RCamarda, VTrapella, CCaló, GRizzi, ARuzza, CFiorini, SMarzola, EReinscheid, RKRegoli, DSalvadori, S Further studies at neuropeptide s position 5: discovery of novel neuropeptide S receptor antagonists. J Med Chem 52:4068-71 (2009)  
Target
Name:
Neuropeptide S receptor
Synonyms:
Gpr154 Npsr1 | Pgr14
Type:
PROTEIN
Mol. Mass.:
42447.53
Organism:
Mus musculus
Description:
ChEMBL_445691
Residue:
371
  
Inhibitor
Name:
BDBM50413780
Synonyms:
CHEMBL507664
Type:
Small organic molecule
Emp. Form.:
C93H156N30O26S
Mol. Mass.:
2142.484
SMILES:
[#6]-[#6]-[#6]-[#6@@H](-[#7]-[#6](=O)-[#6@H](-[#6]-[#6](-[#7])=O)-[#7]-[#6](=O)-[#6@H](-[#6]-[#6]-[#6]\[#7]=[#6](/[#7])-[#7])-[#7]-[#6](=O)-[#6@H](-[#6]-c1ccccc1)-[#7]-[#6](=O)-[#6@@H](-[#7])-[#6]-[#8])-[#6](=O)-[#7]-[#6@@H](-[#6](-[#6])-[#6])-[#6](=O)-[#7]-[#6]-[#6](=O)-[#7]-[#6@@H](-[#6@@H](-[#6])-[#8])-[#6](=O)-[#7]-[#6]-[#6](=O)-[#7]-[#6@@H](-[#6]-[#6]-[#16]-[#6])-[#6](=O)-[#7]-[#6@@H](-[#6]-[#6]-[#6]-[#6]-[#7])-[#6](=O)-[#7]-[#6@@H](-[#6]-[#6]-[#6]-[#6]-[#7])-[#6](=O)-[#7]-[#6@@H](-[#6@@H](-[#6])-[#8])-[#6](=O)-[#7]-[#6@@H](-[#6]-[#8])-[#6](=O)-[#7]-[#6@@H](-[#6]-c1ccccc1)-[#6](=O)-[#7]-[#6@@H](-[#6]-[#6]-[#6](-[#7])=O)-[#6](=O)-[#7]-[#6@@H](-[#6]-[#6]-[#6]\[#7]=[#6](/[#7])-[#7])-[#6](=O)-[#7]-[#6@@H](-[#6])-[#6](=O)-[#7]-[#6@@H](-[#6]-[#6]-[#6]-[#6]-[#7])-[#6](-[#8])=O
: