Target
Protein-glutamine gamma-glutamyltransferase E
Ligand
BDBM50420443
Substrate
Meas. Tech.
ChEMBL_841033 (CHEMBL2091159)
IC50
>80000±n/a nM
Citation
 Prime, MEAndersen, OABarker, JJBrooks, MACheng, RKToogood-Johnson, ICourtney, SMBrookfield, FAYarnold, CJMarston, RWJohnson, PDJohnsen, SFPalfrey, JJVaidya, DErfan, SIchihara, OFelicetti, BPalan, SPedret-Dunn, ASchaertl, SSternberger, IEbneth, AScheel, AWinkler, DToledo-Sherman, LBeconi, MMacdonald, DMuñoz-Sanjuan, IDominguez, CWityak, J Discovery and structure-activity relationship of potent and selective covalent inhibitors of transglutaminase 2 for Huntington's disease. J Med Chem 55:1021-46 (2012)  
Target
Name:
Protein-glutamine gamma-glutamyltransferase E
Synonyms:
Protein-glutamine glutamyltransferase E TGM3_HUMAN | Transglutaminase-3 (TG3)
Type:
Protein
Mol. Mass.:
76625.90
Organism:
Homo sapiens (Human)
Description:
Residue:
693
  
Inhibitor
Name:
BDBM50420443
Synonyms:
CHEMBL2086532
Type:
Small organic molecule
Emp. Form.:
C19H19F3N4O3S
Mol. Mass.:
440.439
SMILES:
FC(F)(F)c1cccnc1N1CCN(CC1)S(=O)(=O)c1ccc(NC(=O)C=C)cc1
: