Target
Leucine-rich repeat serine/threonine-protein kinase 2
Ligand
BDBM50428696
Substrate
Meas. Tech.
ChEMBL_947452 (CHEMBL2345528)
IC50
9.0±n/a nM
Citation
 Garofalo, AWAdler, MAubele, DLBowers, SFranzini, MGoldbach, ELorentzen, CNeitz, RJProbst, GDQuinn, KPSantiago, PSham, HLTam, DTruong, APYe, XMRen, Z Novel cinnoline-based inhibitors of LRRK2 kinase activity. Bioorg Med Chem Lett 23:71-4 (2012)  
Target
Name:
Leucine-rich repeat serine/threonine-protein kinase 2
Synonyms:
Dardarin LRRK2_HUMAN Leucine-rich repeat serine/threonine-protein kinase 2 PARK8
Type:
Protein
Mol. Mass.:
286113.20
Organism:
Homo sapiens (Human)
Description:
Q5S007
Residue:
2527
  
Inhibitor
Name:
BDBM50428696
Synonyms:
CHEMBL2333120
Type:
Small organic molecule
Emp. Form.:
C16H21N5O2
Mol. Mass.:
315.3702
SMILES:
CC(C)Nc1c(nnc2cc(ccc12)N1CCOCC1)C(N)=O
: