Target
Leucine-rich repeat serine/threonine-protein kinase 2
Ligand
BDBM50428698
Substrate
Meas. Tech.
ChEMBL_947452 (CHEMBL2345528)
IC50
9.0±n/a nM
Citation
 Garofalo, AWAdler, MAubele, DLBowers, SFranzini, MGoldbach, ELorentzen, CNeitz, RJProbst, GDQuinn, KPSantiago, PSham, HLTam, DTruong, APYe, XMRen, Z Novel cinnoline-based inhibitors of LRRK2 kinase activity. Bioorg Med Chem Lett 23:71-4 (2012)  
Target
Name:
Leucine-rich repeat serine/threonine-protein kinase 2
Synonyms:
Dardarin LRRK2_HUMAN Leucine-rich repeat serine/threonine-protein kinase 2 PARK8
Type:
Protein
Mol. Mass.:
286113.20
Organism:
Homo sapiens (Human)
Description:
Q5S007
Residue:
2527
  
Inhibitor
Name:
BDBM50428698
Synonyms:
CHEMBL2333118 | US9884828, 2-35
Type:
Small organic molecule
Emp. Form.:
C16H18N6O
Mol. Mass.:
310.3537
SMILES:
CC(C)Nc1c(nnc2cc(ccc12)-c1cnn(C)c1)C(N)=O
: