Target
Leucine-rich repeat serine/threonine-protein kinase 2
Ligand
BDBM50428715
Substrate
Meas. Tech.
ChEMBL_947452 (CHEMBL2345528)
IC50
10.0±n/a nM
Citation
 Garofalo, AWAdler, MAubele, DLBowers, SFranzini, MGoldbach, ELorentzen, CNeitz, RJProbst, GDQuinn, KPSantiago, PSham, HLTam, DTruong, APYe, XMRen, Z Novel cinnoline-based inhibitors of LRRK2 kinase activity. Bioorg Med Chem Lett 23:71-4 (2012)  
Target
Name:
Leucine-rich repeat serine/threonine-protein kinase 2
Synonyms:
Dardarin LRRK2_HUMAN Leucine-rich repeat serine/threonine-protein kinase 2 PARK8
Type:
Protein
Mol. Mass.:
286113.20
Organism:
Homo sapiens (Human)
Description:
Q5S007
Residue:
2527
  
Inhibitor
Name:
BDBM50428715
Synonyms:
CHEMBL2333129 | US9884828, 2-19
Type:
Small organic molecule
Emp. Form.:
C20H20N4O3S
Mol. Mass.:
396.463
SMILES:
CS(=O)(=O)c1ccc(cc1)-c1ccc2c(NC3CCC3)c(nnc2c1)C(N)=O
: