Target
Leucine-rich repeat serine/threonine-protein kinase 2
Ligand
BDBM50432034
Substrate
Meas. Tech.
ChEMBL_949874 (CHEMBL2351467)
IC50
338±n/a nM
Citation
 Franzini, MYe, XMAdler, MAubele, DLGarofalo, AWGauby, SGoldbach, EProbst, GDQuinn, KPSantiago, PSham, HLTam, DTruong, ARen, Z Triazolopyridazine LRRK2 kinase inhibitors. Bioorg Med Chem Lett 23:1967-73 (2013)  
Target
Name:
Leucine-rich repeat serine/threonine-protein kinase 2
Synonyms:
Dardarin LRRK2_HUMAN Leucine-rich repeat serine/threonine-protein kinase 2 PARK8
Type:
Protein
Mol. Mass.:
286113.20
Organism:
Homo sapiens (Human)
Description:
Q5S007
Residue:
2527
  
Inhibitor
Name:
BDBM50432034
Synonyms:
CHEMBL2348974
Type:
Small organic molecule
Emp. Form.:
C14H14N4O2S2
Mol. Mass.:
334.417
SMILES:
CCC(Sc1ccc2nnc(-c3cccs3)n2n1)C(=O)OC
: