Target
Mitogen-activated protein kinase kinase kinase 7
Ligand
BDBM50438181
Substrate
Meas. Tech.
ChEMBL_973092 (CHEMBL2412855)
IC50
1200±n/a nM
Citation
 Hornberger, KRBerger, DMCrew, APDong, HKleinberg, ALi, AHMedeiros, MRMulvihill, MJSiu, KTarrant, JWang, JWeng, FWilde, VLAlbertella, MBittner, MCooke, AGray, MJMaresca, PMay, EMeyn, PPeick, WRomashko, DTanowitz, MTokar, B Discovery and optimization of 7-aminofuro[2,3-c]pyridine inhibitors of TAK1. Bioorg Med Chem Lett 23:4517-22 (2013)  
Target
Name:
Mitogen-activated protein kinase kinase kinase 7
Synonyms:
M3K7_HUMAN Mitogen-activated protein kinase kinase kinase 7 TAK1/TAB1 Transforming growth factor-beta-activated kinase 1 (TAK1)
Type:
Protein
Mol. Mass.:
67199.89
Organism:
Homo sapiens (Human)
Description:
O43318
Residue:
606
  
Inhibitor
Name:
BDBM50438181
Synonyms:
CHEMBL2407788
Type:
Small organic molecule
Emp. Form.:
C24H25N5O2S
Mol. Mass.:
447.553
SMILES:
CSc1cccc(c1)-c1cc2c(cnc(N)c2o1)-c1cnn(c1)C1CCN(CC1)C(C)=O
: