Target
Retinal rod rhodopsin-sensitive cGMP 3',5'-cyclic phosphodiesterase subunit delta
Ligand
BDBM50019826
Substrate
Meas. Tech.
ChEMBL_1361547 (CHEMBL3294871)
Kd
14±n/a nM
Citation
 Zimmermann, GSchultz-Fademrecht, CKüchler, PMurarka, SIsmail, STriola, GNussbaumer, PWittinghofer, AWaldmann, H Structure guided design and kinetic analysis of highly potent benzimidazole inhibitors targeting the PDEd prenyl binding site. J Med Chem 57:5435-48 (2014)  
Target
Name:
Retinal rod rhodopsin-sensitive cGMP 3',5'-cyclic phosphodiesterase subunit delta
Synonyms:
3',5'-cyclic phosphodiesterase PDE6D PDED Retinal rod rhodopsin-sensitive cGMP 3',5'-cyclic phosphodiesterase subunit delta
Type:
PROTEIN
Mol. Mass.:
17418.30
Organism:
Homo sapiens (Human)
Description:
ChEMBL_105761
Residue:
150
  
Inhibitor
Name:
BDBM50019826
Synonyms:
CHEMBL3286906
Type:
Small organic molecule
Emp. Form.:
C41H44N6O2
Mol. Mass.:
652.8271
SMILES:
O=C(OCC(CC1CCNCC1)n1c(nc2ccccc12)-c1ccccc1)C1CCN(CC1)c1nc2ccccc2n1Cc1ccccc1
: