Target
Sucrase-isomaltase, intestinal
Ligand
BDBM50028177
Substrate
Meas. Tech.
ChEMBL_1435477 (CHEMBL3384692)
IC50
250±n/a nM
Citation
 Ghisaidoobe, ATvan den Berg, RJButt, SSStrijland, ADonker-Koopman, WEScheij, Svan den Nieuwendijk, AMKoomen, GJvan Loevezijn, ALeemhuis, MWennekes, Tvan der Stelt, Mvan der Marel, GAvan Boeckel, CAAerts, JMOverkleeft, HS Identification and development of biphenyl substituted iminosugars as improved dual glucosylceramide synthase/neutral glucosylceramidase inhibitors. J Med Chem 57:9096-104 (2014)  
Target
Name:
Sucrase-isomaltase, intestinal
Synonyms:
Alpha glucosidase SI Sucrase Sucrase-isomaltase, intestinal
Type:
PROTEIN
Mol. Mass.:
209423.23
Organism:
Homo sapiens (Human)
Description:
ChEMBL_1435477
Residue:
1827
  
Inhibitor
Name:
BDBM50028177
Synonyms:
CHEMBL3354622
Type:
Small organic molecule
Emp. Form.:
C25H35NO5
Mol. Mass.:
429.5491
SMILES:
C[C@H](OCCCCCN1C[C@H](O)[C@@H](O)[C@H](O)[C@H]1CO)c1ccc(cc1)-c1ccccc1
: