Target
Maltase-glucoamylase
Ligand
BDBM50028177
Substrate
Meas. Tech.
ChEMBL_1435479 (CHEMBL3384694)
IC50
2500±n/a nM
Citation
 Ghisaidoobe, ATvan den Berg, RJButt, SSStrijland, ADonker-Koopman, WEScheij, Svan den Nieuwendijk, AMKoomen, GJvan Loevezijn, ALeemhuis, MWennekes, Tvan der Stelt, Mvan der Marel, GAvan Boeckel, CAAerts, JMOverkleeft, HS Identification and development of biphenyl substituted iminosugars as improved dual glucosylceramide synthase/neutral glucosylceramidase inhibitors. J Med Chem 57:9096-104 (2014)  
Target
Name:
Maltase-glucoamylase
Synonyms:
Alpha glucosidase Glucan 1,4-alpha-glucosidase MGAM MGA_HUMAN Maltase-glucoamylase, intestinal | Synonyms=MGA
Type:
Enzyme
Mol. Mass.:
209817.06
Organism:
Homo sapiens (Human)
Description:
O43451
Residue:
2753
  
Inhibitor
Name:
BDBM50028177
Synonyms:
CHEMBL3354622
Type:
Small organic molecule
Emp. Form.:
C25H35NO5
Mol. Mass.:
429.5491
SMILES:
C[C@H](OCCCCCN1C[C@H](O)[C@@H](O)[C@H](O)[C@H]1CO)c1ccc(cc1)-c1ccccc1
: