Target
Sphingosine 1-phosphate receptor 4
Ligand
BDBM50041691
Substrate
Meas. Tech.
ChEMBL_1446122 (CHEMBL3381002)
EC50
147±n/a nM
Citation
 Buzard, DJKim, SHLopez, LKawasaki, AZhu, XMoody, JThoresen, LCalderon, IUllman, BHan, SLehmann, JGharbaoui, TSengupta, DCalvano, LMontalban, AGMa, YASage, CGao, YSemple, GEdwards, JBarden, JMorgan, MChen, WUsmani, KChen, CSadeque, AChristopher, RJThatte, JFu, LSolomon, MMills, DWhelan, KAl-Shamma, HGatlin, JLe, MGaidarov, IAnthony, TUnett, DJBlackburn, ARueter, JStirn, SBehan, DPJones, RM Discovery of APD334: Design of a Clinical Stage Functional Antagonist of the Sphingosine-1-phosphate-1 Receptor. ACS Med Chem Lett 5:1313-7 (2014)  
Target
Name:
Sphingosine 1-phosphate receptor 4
Synonyms:
EDG6 S1P receptor 4 S1P4 S1PR4_HUMAN Sphingosine 1-phosphate receptor Edg-6 sphingosine-1-phosphate 4 S1P4
Type:
G Protein-Coupled Receptor (GPCR)
Mol. Mass.:
41647.39
Organism:
Homo sapiens (Human)
Description:
Residue:
384
  
Inhibitor
Name:
BDBM50041691
Synonyms:
CHEMBL3358920 | US11149292, Compound (R)-2-(7-(4-cyclopentyl-3-(trifluoromethyl)benzyloxy)-
Type:
Small organic molecule
Emp. Form.:
C26H26F3NO3
Mol. Mass.:
457.4847
SMILES:
OC(=O)C[C@H]1CCc2c1[nH]c1ccc(OCc3ccc(C4CCCC4)c(c3)C(F)(F)F)cc21
: